Target
Gamma-aminobutyric acid receptor subunit alpha-4
Ligand
BDBM81951
Substrate
Ki
38.5±n/a nM
Comments
PDSP_689
Citation
 Gunnersen, DKaufman, CMSkolnick, P Pharmacological properties of recombinant "diazepam-insensitive" GABAA receptors. Neuropharmacology 35:1307-14 (1996)  
Target
Name:
Gamma-aminobutyric acid receptor subunit alpha-4
Synonyms:
GBRA4_RAT Gamma-aminobutyric acid receptor (GABA(A)) subunit alpha-4
Type:
Enzyme
Mol. Mass.:
60972.37
Organism:
Rattus norvegicus (Rat)
Description:
P28471
Residue:
552
  
Inhibitor
Name:
BDBM81951
Synonyms:
CAS_104999 NSC_104999
Type:
Small organic molecule
Emp. Form.:
C17H18N2O4
Mol. Mass.:
314.3358
SMILES:
CCc1c(ncc2[nH]c3cc(OC)c(OC)cc3c12)C(=O)OC
: