Target
Gamma-aminobutyric acid receptor subunit alpha-4
Ligand
BDBM85042
Substrate
Ki
22.5±n/a nM
Comments
PDSP_1552
Citation
 Gunnersen, DKaufman, CMSkolnick, P Pharmacological properties of recombinant "diazepam-insensitive" GABAA receptors. Neuropharmacology 35:1307-14 (1996)  
Target
Name:
Gamma-aminobutyric acid receptor subunit alpha-4
Synonyms:
GBRA4_RAT Gamma-aminobutyric acid receptor (GABA(A)) subunit alpha-4
Type:
Enzyme
Mol. Mass.:
60972.37
Organism:
Rattus norvegicus (Rat)
Description:
P28471
Residue:
552
  
Inhibitor
Name:
BDBM85042
Synonyms:
CHEMBL44613 | PW-007A
Type:
Small organic molecule
Emp. Form.:
C17H13N3O2
Mol. Mass.:
291.304
SMILES:
COc1ccc2ncc3c([nH]n(-c4ccccc4)c3=O)c2c1
: