Target
Gamma-aminobutyric acid receptor subunit alpha-4
Ligand
BDBM85038
Substrate
Ki
11.6±n/a nM
Comments
PDSP_1565
Citation
 Gunnersen, DKaufman, CMSkolnick, P Pharmacological properties of recombinant "diazepam-insensitive" GABAA receptors. Neuropharmacology 35:1307-14 (1996)  
Target
Name:
Gamma-aminobutyric acid receptor subunit alpha-4
Synonyms:
GBRA4_RAT Gamma-aminobutyric acid receptor (GABA(A)) subunit alpha-4
Type:
Enzyme
Mol. Mass.:
60972.37
Organism:
Rattus norvegicus (Rat)
Description:
P28471
Residue:
552
  
Inhibitor
Name:
BDBM85038
Synonyms:
CHEMBL43948 | PZII-029
Type:
Small organic molecule
Emp. Form.:
C18H15N3O3
Mol. Mass.:
321.33
SMILES:
COc1ccc(cc1)-n1[nH]c2c(cnc3cc(OC)ccc23)c1=O
: