Target
Gamma-aminobutyric acid receptor subunit alpha-4
Ligand
BDBM50044941
Substrate
Ki
5.2±n/a nM
Comments
PDSP_1993
Citation
 Gunnersen, DKaufman, CMSkolnick, P Pharmacological properties of recombinant "diazepam-insensitive" GABAA receptors. Neuropharmacology 35:1307-14 (1996)  
Target
Name:
Gamma-aminobutyric acid receptor subunit alpha-4
Synonyms:
GBRA4_RAT Gamma-aminobutyric acid receptor (GABA(A)) subunit alpha-4
Type:
Enzyme
Mol. Mass.:
60972.37
Organism:
Rattus norvegicus (Rat)
Description:
P28471
Residue:
552
  
Inhibitor
Name:
BDBM50044941
Synonyms:
8-Azido-5-methyl-6-oxo-5,6-dihydro-4H-2,5,10b-triaza-benzo[e]azulene-3-carboxylic acid tert-butyl ester ZG 234
Type:
Small organic molecule
Emp. Form.:
C17H18N6O3
Mol. Mass.:
354.3632
SMILES:
CN1Cc2c(ncn2-c2ccc(cc2C1=O)N=[N+]=[N-])C(=O)OC(C)(C)C
: