Target
Gamma-aminobutyric acid receptor subunit alpha-4
Ligand
BDBM85040
Substrate
Ki
573±n/a nM
Comments
PDSP_1997
Citation
 Gunnersen, DKaufman, CMSkolnick, P Pharmacological properties of recombinant "diazepam-insensitive" GABAA receptors. Neuropharmacology 35:1307-14 (1996)  
Target
Name:
Gamma-aminobutyric acid receptor subunit alpha-4
Synonyms:
GBRA4_RAT Gamma-aminobutyric acid receptor (GABA(A)) subunit alpha-4
Type:
Enzyme
Mol. Mass.:
60972.37
Organism:
Rattus norvegicus (Rat)
Description:
P28471
Residue:
552
  
Inhibitor
Name:
BDBM85040
Synonyms:
CAS_123700 ZK 91296
Type:
Small organic molecule
Emp. Form.:
C23H22N2O4
Mol. Mass.:
390.4318
SMILES:
CCOC(=O)c1ncc2[nH]c3cccc(OCc4ccccc4)c3c2c1COC
: