Target
D(2) dopamine receptor
Ligand
BDBM50091032
Substrate
Ki
4200±n/a nM
Comments
PDSP_2082
Citation
 Seeman, PGuan, HCNobrega, JJiwa, DMarkstein, RBalk, JHPicetti, RBorrelli, EVan Tol, HH Dopamine D2-like sites in schizophrenia, but not in Alzheimer's, Huntington's, or control brains, for [3H]benzquinoline. Synapse 25:137-46 (1997)  
Target
Name:
D(2) dopamine receptor
Synonyms:
D(2) dopamine receptor DOPAMINE D2 Long DRD2 Dopamine D2 receptor Dopamine D2 receptor (D2R) Dopamine2-like | d2
Type:
Cell-surface receptors
Mol. Mass.:
50647.10
Organism:
Homo sapiens (Human)
Description:
P14416
Residue:
443
  
Inhibitor
Name:
BDBM50091032
Synonyms:
6,7-Dihydroxy-1,2,3,4-tetrahydro-naphthalen-2-yl-ammonium(R(+)ADTN) | Aminotetralin-6,7-dihydroxy-(+)
Type:
Small organic molecule
Emp. Form.:
C10H14NO2
Mol. Mass.:
180.2231
SMILES:
[NH3+][C@@H]1CCc2cc(O)c(O)cc2C1
: