Target
D(3) dopamine receptor
Ligand
BDBM50020222
Substrate
Ki
2.4±n/a nM
Comments
PDSP_196
Citation
 Lejeune, FNewman-Tancredi, AAudinot, VMillan, MJ Interactions of (+)- and (-)-8- and 7-hydroxy-2-(di-n-propylamino)tetralin at human (h)D3, hD2 and h serotonin1A receptors and their modulation of the activity of serotoninergic and dopaminergic neurones in rats. J Pharmacol Exp Ther 280:1241-9 (1997) Target
Name:
D(3) dopamine receptor
Synonyms:
DOPAMINE D3 DRD3_HUMAN Dopamine D3 receptor (D3) Dopamine receptor Dopamine receptor D3
Type:
Mol. Mass.:
44243.43
Organism:
Homo sapiens (Human)
Description:
Residue:
400
  
Inhibitor
Name:
BDBM50020222
Synonyms:
(+/-)-7-(dipropylamino)-5,6,7,8-tetrahydronaphthalen-2-ol (R,S) 7-Dipropylamino-5,6,7,8-tetrahydro-naphthalen-2-ol 7-Dipropylamino-5,6,7,8-tetrahydro-naphthalen-2-ol 7-OH-DPAT 7-OH-DPAT,(-) CHEMBL1255966 | CHEMBL285755
Type:
Small organic molecule
Emp. Form.:
C16H25NO
Mol. Mass.:
247.3758
SMILES:
CCCN(CCC)C1CCc2ccc(O)cc2C1
: