Target
Prothrombin
Ligand
BDBM85087
Substrate
Ki
24±n/a nM
Comments
PDSP_4213
Citation
 Ahn, HSFoster, CBoykow, GArik, LSmith-Torhan, AHesk, DChatterjee, M Binding of a thrombin receptor tethered ligand analogue to human platelet thrombin receptor. Mol Pharmacol 51:350-6 (1997)  
Target
Name:
Prothrombin
Synonyms:
Activation peptide fragment 1 Coagulation factor II Prothrombin precursor Thrombin heavy chain | Thrombin light chain
Type:
Protein
Mol. Mass.:
70029.57
Organism:
Homo sapiens (Human)
Description:
P00734
Residue:
622
  
Inhibitor
Name:
BDBM85087
Synonyms:
L-Ala-4-Fluoro-L-Phe-L-Arg-3-cyclohexyl-L-Ala-N-amidino-L-Lys-L-Phe-NH2 | haTRAP
Type:
Small organic molecule
Emp. Form.:
C43H66FN13O6
Mol. Mass.:
880.066
SMILES:
[#6]-[#6@H](-[#7])-[#6](=O)-[#7]-[#6@@H](-[#6]-c1ccc(F)cc1)-[#6](=O)-[#7]-[#6@@H](-[#6]-[#6]-[#6]\[#7]=[#6](\[#7])-[#7])-[#6](=O)-[#7]-[#6@@H](-[#6]-[#6]-1-[#6]-[#6]-[#6]-[#6]-[#6]-1)-[#6](=O)-[#7]-[#6@@H](-[#6]-[#6]-[#6]-[#6]\[#7]=[#6](/[#7])-[#7])-[#6](=O)-[#7]-[#6@@H](-[#6]-c1ccccc1)-[#6](-[#7])=O
: