Target
D(3) dopamine receptor
Ligand
BDBM85097
Substrate
Ki
630.95±n/a nM
Comments
PDSP_1670
Citation
 Kennett, GAWood, MDBright, FTrail, BRiley, GHolland, VAvenell, KYStean, TUpton, NBromidge, SForbes, ITBrown, AMMiddlemiss, DNBlackburn, TP SB 242084, a selective and brain penetrant 5-HT2C receptor antagonist. Neuropharmacology 36:609-20 (1997)  
Target
Name:
D(3) dopamine receptor
Synonyms:
DOPAMINE D3 | DRD3
Type:
Enzyme Catalytic Domain
Mol. Mass.:
44279.64
Organism:
C.H.O.
Description:
DOPAMINE D3 DRD3 C.H.O.::A0A3Q0CXS4
Residue:
400
  
Inhibitor
Name:
BDBM85097
Synonyms:
CAS_181632-25-7 SB 242084
Type:
Small organic molecule
Emp. Form.:
C21H19ClN4O2
Mol. Mass.:
394.854
SMILES:
Cc1cc2CCN(C(=O)Nc3ccc(Oc4cccnc4C)nc3)c2cc1Cl
: