Target
Substance-P receptor
Ligand
BDBM85098
Substrate
Ki
>10000±n/a nM
Comments
PDSP_1626
Citation
 Bonhaus, DWWeinhardt, KKTaylor, MDeSouza, AMcNeeley, PMSzczepanski, KFontana, DJTrinh, JRocha, CLDawson, MWFlippin, LAEglen, RM RS-102221: a novel high affinity and selective, 5-HT2C receptor antagonist. Neuropharmacology 36:621-9 (1997)  
Target
Name:
Substance-P receptor
Synonyms:
NK-1 receptor NK1 Receptor NK1R_HUMAN Neurokinin-1 (NK-1) SPR TACR1 Tachykinin receptor 1 (NK1) | tachykinin
Type:
G Protein-Coupled Receptor (GPCR)
Mol. Mass.:
46254.43
Organism:
Homo sapiens (Human)
Description:
P25103
Residue:
407
  
Inhibitor
Name:
BDBM85098
Synonyms:
N-[5-[5-(2,4-Dioxo-1,3,8-triazaspiro[4.5]decan-8-yl)-1-oxopentyl]-2,4-dimethoxyphenyl]-4-(trifluoromethyl)benzenesulfonamide | RS-102221
Type:
Small organic molecule
Emp. Form.:
C27H31F3N4O7S
Mol. Mass.:
612.618
SMILES:
[#6]-[#8]-c1cc(-[#8]-[#6])c(cc1-[#7][S;v6](=O)(=O)c1ccc(cc1)C(F)(F)F)-[#6](=O)-[#6]-[#6]-[#6]-[#6]-[#7]-1-[#6]-[#6]C2([#6]-[#6]-1)[#7]-[#6](=O)-[#7]-[#6]2=O
: