Target
Galanin receptor type 1
Ligand
BDBM85171
Substrate
Ki
1000±n/a nM
Comments
PDSP_860
Citation
 Smith, KEForray, CWalker, MWJones, KATamm, JABard, JBranchek, TALinemeyer, DLGerald, C Expression cloning of a rat hypothalamic galanin receptor coupled to phosphoinositide turnover. J Biol Chem 272:24612-6 (1997)  
Target
Name:
Galanin receptor type 1
Synonyms:
GALR1_RAT Galanin receptor type 1 Galnr1 | Galr1
Type:
Enzyme Catalytic Domain
Mol. Mass.:
38883.91
Organism:
RAT
Description:
Galanin R1 GALR1 RAT::Q62805
Residue:
346
  
Inhibitor
Name:
BDBM85171
Synonyms:
Galanin (1-29),[D-Trp2]
Type:
Small organic molecule
Emp. Form.:
C137H204N42O39
Mol. Mass.:
3063.3437
SMILES:
CCC(C)C(NC(=O)C(C)NC(=O)C(Cc1cnc[nH]1)NC(=O)C1CCCN1C(=O)CNC(=O)C(CC(C)C)NC(=O)C(CC(C)C)NC(=O)C(Cc1ccc(O)cc1)NC(=O)CNC(=O)C(C)NC(=O)C(CO)NC(=O)C(CC(N)=O)NC(=O)C(CC(C)C)NC(=O)C(NC(=O)[C@H](Cc1c[nH]c2ccccc12)NC(=O)CN)C(C)O)C(=O)NC(CC(O)=O)C(=O)NC(CC(N)=O)C(=O)NC(Cc1cnc[nH]1)C(=O)NC(CCCN=C(N)N)C(=O)NC(CO)C(=O)NC(Cc1ccccc1)C(=O)NC(CO)C(=O)NC(CC(O)=O)C(=O)NC(CCCCN)C(=O)NC(Cc1cnc[nH]1)C(=O)NCC(=O)NC(CC(C)C)C(N)=O
: