Target
Galanin receptor type 2
Ligand
BDBM50307256
Substrate
Ki
19±n/a nM
Comments
PDSP_848
Citation
 Smith, KEForray, CWalker, MWJones, KATamm, JABard, JBranchek, TALinemeyer, DLGerald, C Expression cloning of a rat hypothalamic galanin receptor coupled to phosphoinositide turnover. J Biol Chem 272:24612-6 (1997)  
Target
Name:
Galanin receptor type 2
Synonyms:
GALR2_RAT Galanin receptor 2 Galnr2 | Galr2
Type:
Enzyme Catalytic Domain
Mol. Mass.:
40697.04
Organism:
RAT
Description:
Galanin R2 GALR2 RAT::O08726
Residue:
372
  
Inhibitor
Name:
BDBM50307256
Synonyms:
CHEMBL604373 Gal(1-13)-Std I
Type:
Small organic molecule
Emp. Form.:
C138H199N35O30
Mol. Mass.:
2828.2732
SMILES:
CC(C)C[C@H](NC(=O)[C@H](CC(C)C)NC(=O)[C@@H](Cc1c[nH]c2ccccc12)NC(=O)[C@H](Cc1ccccc1)NC(=O)[C@@H](Cc1c[nH]c2ccccc12)NC(=O)[C@H](CCC(N)=O)NC(=O)[C@H](CCC(N)=O)NC(=O)[C@@H]1CCCN1C(=O)[C@H](CCCCN)NC(=O)[C@@H]1CCCN1C(=O)[C@@H](CCCN=C(N)N)NC(=O)[C@@H]1CCCN1C(=O)CNC(=O)[C@H](CC(C)C)NC(=O)[C@H](CC(C)C)NC(=O)[C@H](Cc1ccc(O)cc1)NC(=O)CNC(=O)[C@H](C)NC(=O)[C@H](CO)NC(=O)[C@H](CC(N)=O)NC(=O)[C@H](CC(C)C)NC(=O)[C@@H](NC(=O)[C@H](Cc1c[nH]c2ccccc12)NC(=O)CN)[C@@H](C)O)C(N)=O
: