Target
5-hydroxytryptamine receptor 4
Ligand
BDBM50007871
Substrate
Ki
501.18±n/a nM
Comments
PDSP_1919
Citation
 Van den Wyngaert, IGommeren, WVerhasselt, PJurzak, MLeysen, JLuyten, WBender, E Cloning and expression of a human serotonin 5-HT4 receptor cDNA. J Neurochem 69:1810-9 (1997)  
Target
Name:
5-hydroxytryptamine receptor 4
Synonyms:
5-HT-4 5-HT4L 5-hydroxytryptamine receptor 4 Htr4 Serotonin 4 (5-HT4) receptor
Type:
Enzyme Catalytic Domain
Mol. Mass.:
46117.31
Organism:
RAT
Description:
5-HT4 HTR4 RAT::Q62758
Residue:
406
  
Inhibitor
Name:
BDBM50007871
Synonyms:
CHEMBL8197 TROPISETRON
Type:
Small organic molecule
Emp. Form.:
C17H20N2O2
Mol. Mass.:
284.3529
SMILES:
CN1C2CCC1CC(C2)OC(=O)c1c[nH]c2ccccc12
: