Target
Gamma-aminobutyric acid receptor subunit alpha-1
Ligand
BDBM85196
Substrate
Ki
41.68±n/a nM
Comments
PDSP_1846
Citation
 Ebert, BThompson, SASaounatsou, KMcKernan, RKrogsgaard-Larsen, PWafford, KA Differences in agonist/antagonist binding affinity and receptor transduction using recombinant human gamma-aminobutyric acid type A receptors. Mol Pharmacol 52:1150-6 (1997) Target
Name:
Gamma-aminobutyric acid receptor subunit alpha-1
Synonyms:
Benzodiazepine central GABA A Benzodiazepine liver GABA(A) receptor subunit alpha-1 GABA-A receptor GBRA1_HUMAN TBPS | agonist GABA site
Type:
Protein
Mol. Mass.:
51817.35
Organism:
Homo sapiens (Human)
Description:
P14867
Residue:
456
  
Inhibitor
Name:
BDBM85196
Synonyms:
CAS_5448 Thiomuscimol
Type:
Small organic molecule
Emp. Form.:
C4H6N2OS
Mol. Mass.:
130.168
SMILES:
NCc1cc(=O)[nH]s1
: