Target
Gamma-aminobutyric acid receptor subunit alpha-1
Ligand
BDBM50087272
Substrate
Ki
151.35±n/a nM
Comments
PDSP_1431
Citation
 Ebert, BThompson, SASaounatsou, KMcKernan, RKrogsgaard-Larsen, PWafford, KA Differences in agonist/antagonist binding affinity and receptor transduction using recombinant human gamma-aminobutyric acid type A receptors. Mol Pharmacol 52:1150-6 (1997) Target
Name:
Gamma-aminobutyric acid receptor subunit alpha-1
Synonyms:
Benzodiazepine central GABA A Benzodiazepine liver GABA(A) receptor subunit alpha-1 GABA-A receptor GBRA1_HUMAN TBPS | agonist GABA site
Type:
Protein
Mol. Mass.:
51817.35
Organism:
Homo sapiens (Human)
Description:
P14867
Residue:
456
  
Inhibitor
Name:
BDBM50087272
Synonyms:
CHEMBL34155 Piperidine-4-sulfonic acid | Piperidine-4-sulfonic acid (P4S)
Type:
Small organic molecule
Emp. Form.:
C5H11NO3S
Mol. Mass.:
165.211
SMILES:
OS(=O)(=O)C1CCNCC1
: