Target
Gamma-aminobutyric acid receptor subunit alpha-2
Ligand
BDBM85196
Substrate
Ki
85.11±n/a nM
Comments
PDSP_1846
Citation
 Ebert, BThompson, SASaounatsou, KMcKernan, RKrogsgaard-Larsen, PWafford, KA Differences in agonist/antagonist binding affinity and receptor transduction using recombinant human gamma-aminobutyric acid type A receptors. Mol Pharmacol 52:1150-6 (1997) Target
Name:
Gamma-aminobutyric acid receptor subunit alpha-2
Synonyms:
GABA receptor alpha-2 subunit GBRA2_HUMAN | Gamma-aminobutyric acid receptor subunit alpha-2 (GABRA2)
Type:
Protein
Mol. Mass.:
51338.78
Organism:
Homo sapiens (Human)
Description:
P47869
Residue:
451
  
Inhibitor
Name:
BDBM85196
Synonyms:
CAS_5448 Thiomuscimol
Type:
Small organic molecule
Emp. Form.:
C4H6N2OS
Mol. Mass.:
130.168
SMILES:
NCc1cc(=O)[nH]s1
: