Target
Gamma-aminobutyric acid receptor subunit alpha-3
Ligand
BDBM82002
Substrate
Ki
165.95±n/a nM
Comments
PDSP_1853
Citation
 Ebert, BThompson, SASaounatsou, KMcKernan, RKrogsgaard-Larsen, PWafford, KA Differences in agonist/antagonist binding affinity and receptor transduction using recombinant human gamma-aminobutyric acid type A receptors. Mol Pharmacol 52:1150-6 (1997) Target
Name:
Gamma-aminobutyric acid receptor subunit alpha-3
Synonyms:
GABA A Alpha3Beta3Gamma2 GABA C GABA-A receptor GBRA3_HUMAN agonist GABA site
Type:
Enzyme Catalytic Domain
Mol. Mass.:
55175.47
Organism:
Homo sapiens (Human)
Description:
GABA A Alpha3Beta1Gamma2 0 HUMAN::P34903
Residue:
492
  
Inhibitor
Name:
BDBM82002
Synonyms:
CAS_64603-91-4 THIP
Type:
Small organic molecule
Emp. Form.:
C6H8N2O2
Mol. Mass.:
140.1399
SMILES:
O=c1[nH]oc2CNCCc12
: