Target
Gamma-aminobutyric acid receptor subunit alpha-5
Ligand
BDBM24183
Substrate
Ki
8.7±n/a nM
Comments
PDSP_867
Citation
 Ebert, BThompson, SASaounatsou, KMcKernan, RKrogsgaard-Larsen, PWafford, KA Differences in agonist/antagonist binding affinity and receptor transduction using recombinant human gamma-aminobutyric acid type A receptors. Mol Pharmacol 52:1150-6 (1997) Target
Name:
Gamma-aminobutyric acid receptor subunit alpha-5
Synonyms:
GABA receptor alpha-5 subunit GABRA5 Gamma-aminobutyric acid receptor subunit alpha-5 (GABA(A)) | Gamma-aminobutyric acid receptor subunit alpha-5 (GABAA)
Type:
Enzyme
Mol. Mass.:
52160.59
Organism:
Homo sapiens (Human)
Description:
P31644
Residue:
462
  
Inhibitor
Name:
BDBM24183
Synonyms:
4-amino-n-[2,3-3H]butyric acid Aminalon GABA [3H]GABA | cid_119
Type:
Radiolabeled ligand
Emp. Form.:
C4H9NO2
Mol. Mass.:
103.1198
SMILES:
NCCCC(O)=O
: