Target
Gamma-aminobutyric acid receptor subunit alpha-5
Ligand
BDBM50087272
Substrate
Ki
58.88±n/a nM
Comments
PDSP_1431
Citation
 Ebert, BThompson, SASaounatsou, KMcKernan, RKrogsgaard-Larsen, PWafford, KA Differences in agonist/antagonist binding affinity and receptor transduction using recombinant human gamma-aminobutyric acid type A receptors. Mol Pharmacol 52:1150-6 (1997) Target
Name:
Gamma-aminobutyric acid receptor subunit alpha-5
Synonyms:
GABA receptor alpha-5 subunit GABRA5 Gamma-aminobutyric acid receptor subunit alpha-5 (GABA(A)) | Gamma-aminobutyric acid receptor subunit alpha-5 (GABAA)
Type:
Enzyme
Mol. Mass.:
52160.59
Organism:
Homo sapiens (Human)
Description:
P31644
Residue:
462
  
Inhibitor
Name:
BDBM50087272
Synonyms:
CHEMBL34155 Piperidine-4-sulfonic acid | Piperidine-4-sulfonic acid (P4S)
Type:
Small organic molecule
Emp. Form.:
C5H11NO3S
Mol. Mass.:
165.211
SMILES:
OS(=O)(=O)C1CCNCC1
: