Target
Gamma-aminobutyric acid receptor subunit alpha-6
Ligand
BDBM50000687
Substrate
Ki
34.67±n/a nM
Comments
PDSP_1758
Citation
 Ebert, BThompson, SASaounatsou, KMcKernan, RKrogsgaard-Larsen, PWafford, KA Differences in agonist/antagonist binding affinity and receptor transduction using recombinant human gamma-aminobutyric acid type A receptors. Mol Pharmacol 52:1150-6 (1997) Target
Name:
Gamma-aminobutyric acid receptor subunit alpha-6
Synonyms:
GABA A alpha6 GABRA6 | GBRA6_HUMAN
Type:
Enzyme Catalytic Domain
Mol. Mass.:
51029.60
Organism:
Homo sapiens (Human)
Description:
GABA A alpha6 0 HUMAN::Q16445
Residue:
453
  
Inhibitor
Name:
BDBM50000687
Synonyms:
2-(3-Carboxy-propyl)-6-(4-methoxy-phenyl)-2H-pyridazin-3-ylidene-ammonium; bromide(gabazine) 6-Amino-1-(3-carboxy-propyl)-3-(4-methoxy-phenyl)-pyridazin-1-ium; bromide SR 95531
Type:
Small organic molecule
Emp. Form.:
C15H18N3O3
Mol. Mass.:
288.3212
SMILES:
COc1ccc(cc1)-c1ccc(=[NH2+])n(CCCC(O)=O)n1
: