Target
Gamma-aminobutyric acid receptor subunit alpha-6
Ligand
BDBM82002
Substrate
Ki
102.32±n/a nM
Comments
PDSP_1853
Citation
 Ebert, BThompson, SASaounatsou, KMcKernan, RKrogsgaard-Larsen, PWafford, KA Differences in agonist/antagonist binding affinity and receptor transduction using recombinant human gamma-aminobutyric acid type A receptors. Mol Pharmacol 52:1150-6 (1997) Target
Name:
Gamma-aminobutyric acid receptor subunit alpha-6
Synonyms:
GABA A alpha6 GABRA6 | GBRA6_HUMAN
Type:
Enzyme Catalytic Domain
Mol. Mass.:
51029.60
Organism:
Homo sapiens (Human)
Description:
GABA A alpha6 0 HUMAN::Q16445
Residue:
453
  
Inhibitor
Name:
BDBM82002
Synonyms:
CAS_64603-91-4 THIP
Type:
Small organic molecule
Emp. Form.:
C6H8N2O2
Mol. Mass.:
140.1399
SMILES:
O=c1[nH]oc2CNCCc12
: