Target
Norepinephrine transporter
Ligand
BDBM50028066
Substrate
Ki
3411±n/a nM
Comments
PDSP_639
Citation
 Owens, MJMorgan, WNPlott, SJNemeroff, CB Neurotransmitter receptor and transporter binding profile of antidepressants and their metabolites. J Pharmacol Exp Ther 283:1305-22 (1997) Target
Name:
Norepinephrine transporter
Synonyms:
Type:
Enzyme Catalytic Domain
Mol. Mass.:
2082.45
Organism:
RAT
Description:
Norepinephrine transporter 0 RAT::Q9JIA2
Residue:
19
MLLARMKPQVQPELGGADQ
  
Inhibitor
Name:
BDBM50028066
Synonyms:
4-(3,4-Dichloro-phenyl)-1,2,3,4-tetrahydro-naphthalen-1-ylamine, HCl Desmethylsertraline
Type:
Small organic molecule
Emp. Form.:
C16H15Cl2N
Mol. Mass.:
292.203
SMILES:
N[C@H]1CC[C@@H](c2ccc(Cl)c(Cl)c2)c2ccccc12
: