Target
Muscarinic acetylcholine receptor M2
Ligand
BDBM50004656
Substrate
Ki
2060±n/a nM
Comments
PDSP_467
Citation
 Kovacs, IYamamura, HIWaite, SLVarga, EVRoeske, WR Pharmacological comparison of the cloned human and rat M2 muscarinic receptor genes expressed in the murine fibroblast (B82) cell line. J Pharmacol Exp Ther 284:500-7 (1998) Target
Name:
Muscarinic acetylcholine receptor M2
Synonyms:
ACM2_RAT Chrm-2 | Chrm2
Type:
Enzyme Catalytic Domain
Mol. Mass.:
51555.53
Organism:
RAT
Description:
P10980
Residue:
466
  
Inhibitor
Name:
BDBM50004656
Synonyms:
(2-Carbamoyloxy-ethyl)-trimethyl-ammonium (2-Hydroxyethyl)trimethyl ammonium chloride carbamate (carbachol)(2-Carbamoyloxy-ethyl)-trimethyl-ammonium 2-((Aminocarbonyl)oxy)-N,N,N-trimethylethanaminum chloride 2-(carbamoyloxy)-N,N,N-trimethylethanaminium chloride CARBASTAT Carbachol chloride Choline carbamate chloride Choline chlorine carbamate Karbamoylcholin chlorid | MIOSTAT
Type:
Small organic molecule
Emp. Form.:
C6H15N2O2
Mol. Mass.:
147.195
SMILES:
C[N+](C)(C)CCOC(N)=O
: