Target
Muscarinic acetylcholine receptor M2
Ligand
BDBM81799
Substrate
Ki
153±n/a nM
Comments
PDSP_932
Citation
 Kovacs, IYamamura, HIWaite, SLVarga, EVRoeske, WR Pharmacological comparison of the cloned human and rat M2 muscarinic receptor genes expressed in the murine fibroblast (B82) cell line. J Pharmacol Exp Ther 284:500-7 (1998) Target
Name:
Muscarinic acetylcholine receptor M2
Synonyms:
ACM2_HUMAN Cholinergic, muscarinic M2 Muscarinic acetylcholine receptor M2 and M5 | RecName: Full=Muscarinic acetylcholine receptor M2
Type:
GPCR
Mol. Mass.:
51730.61
Organism:
Homo sapiens (Human)
Description:
P08172
Residue:
466
  
Inhibitor
Name:
BDBM81799
Synonyms:
CAS_98299-40-2 NSC_3602 | hexahydrosiladifenidol
Type:
Small organic molecule
Emp. Form.:
C20H33NOSi
Mol. Mass.:
331.5676
SMILES:
O[Si](CCCN1CCCCC1)(C1CCCCC1)c1ccccc1
: