Target
Muscarinic acetylcholine receptor M2
Ligand
BDBM50018550
Substrate
Ki
9060±n/a nM
Comments
PDSP_1069
Citation
 Kovacs, IYamamura, HIWaite, SLVarga, EVRoeske, WR Pharmacological comparison of the cloned human and rat M2 muscarinic receptor genes expressed in the murine fibroblast (B82) cell line. J Pharmacol Exp Ther 284:500-7 (1998) Target
Name:
Muscarinic acetylcholine receptor M2
Synonyms:
ACM2_HUMAN Cholinergic, muscarinic M2 Muscarinic acetylcholine receptor M2 and M5 | RecName: Full=Muscarinic acetylcholine receptor M2
Type:
GPCR
Mol. Mass.:
51730.61
Organism:
Homo sapiens (Human)
Description:
P08172
Residue:
466
  
Inhibitor
Name:
BDBM50018550
Synonyms:
1'-Benzyl-3-phenyl-[3,4']bipiperidinyl-2,6-dione Dexetimide | Levetimide
Type:
Small organic molecule
Emp. Form.:
C23H26N2O2
Mol. Mass.:
362.4647
SMILES:
O=C1CC[C@](C2CCN(Cc3ccccc3)CC2)(C(=O)N1)c1ccccc1
: