Target
Muscarinic acetylcholine receptor M2
Ligand
BDBM50064176
Substrate
Ki
42±n/a nM
Comments
PDSP_1220
Citation
 Kovacs, IYamamura, HIWaite, SLVarga, EVRoeske, WR Pharmacological comparison of the cloned human and rat M2 muscarinic receptor genes expressed in the murine fibroblast (B82) cell line. J Pharmacol Exp Ther 284:500-7 (1998) Target
Name:
Muscarinic acetylcholine receptor M2
Synonyms:
ACM2_HUMAN Cholinergic, muscarinic M2 Muscarinic acetylcholine receptor M2 and M5 | RecName: Full=Muscarinic acetylcholine receptor M2
Type:
GPCR
Mol. Mass.:
51730.61
Organism:
Homo sapiens (Human)
Description:
P08172
Residue:
466
  
Inhibitor
Name:
BDBM50064176
Synonyms:
CHEMBL27673 METHOCTRAMINE N1,N8-bis(6-(2-methoxybenzylamino)hexyl)octane-1,8-diamine
Type:
Small organic molecule
Emp. Form.:
C36H62N4O2
Mol. Mass.:
582.9031
SMILES:
COc1ccccc1CNCCCCCCNCCCCCCCCNCCCCCCNCc1ccccc1OC
: