Target
Muscarinic acetylcholine receptor M2
Ligand
BDBM39344
Substrate
Ki
15.4±n/a nM
Comments
PDSP_1530
Citation
 Kovacs, IYamamura, HIWaite, SLVarga, EVRoeske, WR Pharmacological comparison of the cloned human and rat M2 muscarinic receptor genes expressed in the murine fibroblast (B82) cell line. J Pharmacol Exp Ther 284:500-7 (1998) Target
Name:
Muscarinic acetylcholine receptor M2
Synonyms:
ACM2_HUMAN Cholinergic, muscarinic M2 Muscarinic acetylcholine receptor M2 and M5 | RecName: Full=Muscarinic acetylcholine receptor M2
Type:
GPCR
Mol. Mass.:
51730.61
Organism:
Homo sapiens (Human)
Description:
P08172
Residue:
466
  
Inhibitor
Name:
BDBM39344
Synonyms:
4-amino-N-[2-(diethylamino)ethyl]benzamide;hydrochloride MLS000069436 PROCAINAMIDE HYDROCHLORIDE cid_66068
Type:
Small organic molecule
Emp. Form.:
C13H21N3O
Mol. Mass.:
235.3253
SMILES:
CCN(CC)CCNC(=O)c1ccc(N)cc1
: