Target
Adenosine receptor A2a
Ligand
BDBM50004461
Substrate
Ki
2.2±n/a nM
Comments
PDSP_2621
Citation
 Camaioni, EDi Francesco, EVittori, SVolpini, RCristalli, G Adenosine receptor agonists: synthesis and biological evaluation of the diastereoisomers of 2-(3-hydroxy-3-phenyl-1-propyn-1-yl)NECA. Bioorg Med Chem 5:2267-75 (1997)  
Target
Name:
Adenosine receptor A2a
Synonyms:
AA2AR_RAT Adenosine A2 receptor Adenosine Receptors A2a (A2a) Adenosine receptors A2a Rat striatal adenosine A2a receptor
Type:
G Protein-Coupled Receptor (GPCR)
Mol. Mass.:
45015.65
Organism:
Rattus norvegicus (rat)
Description:
Rat A2A receptors expressed in CHO cells.
Residue:
410
  
Inhibitor
Name:
BDBM50004461
Synonyms:
(2S,3R,5R)-5-[6-amino-2-(hex-1-yn-1-yl)-9H-purin-9-yl]-N-ethyl-3,4-dihydroxyoxolane-2-carboxamide 5-(6-Amino-2-hex-1-ynyl-purin-9-yl)-3,4-dihydroxy-tetrahydro-furan-2-carboxylic acid ethylamide HENECA
Type:
Small organic molecule
Emp. Form.:
C18H24N6O4
Mol. Mass.:
388.421
SMILES:
CCCCC#Cc1nc(N)c2ncn([C@@H]3O[C@@H]([C@H](O)C3O)C(=O)NCC)c2n1
: