Target
Somatostatin receptor type 3
Ligand
BDBM82464
Substrate
Ki
87±n/a nM
Comments
PDSP_1591
Citation
 Meyerhof, W The elucidation of somatostatin receptor functions: a current view. Rev Physiol Biochem Pharmacol 133:55-108 (1998)  
Target
Name:
Somatostatin receptor type 3
Synonyms:
SOMATOSTATIN SST3 Somatostatin receptor Somatostatin receptor type 3 | Sstr3
Type:
Enzyme Catalytic Domain
Mol. Mass.:
47161.54
Organism:
RAT
Description:
SOMATOSTATIN SST3 SSTR3 RAT::P30936
Residue:
428
  
Inhibitor
Name:
BDBM82464
Synonyms:
CAS_71306 RC 160 | Vapreotide
Type:
Small organic molecule
Emp. Form.:
C57H70N12O9S2
Mol. Mass.:
1131.371
SMILES:
CC(C)C1NC(=O)C(CCCCN)NC(=O)C(Cc2c[nH]c3ccccc23)NC(=O)C(Cc2ccc(O)cc2)NC(=O)C(CSSCC(NC1=O)C(=O)NC(Cc1c[nH]c2ccccc12)C(N)=O)NC(=O)C(N)Cc1ccccc1
: