Target
Melatonin receptor type 1A
Ligand
BDBM50034110
Substrate
Ki
0.16±n/a nM
Comments
PDSP_1193
Citation
 Sugden, DPickering, HTeh, MTGarratt, PJ Melatonin receptor pharmacology: toward subtype specificity. Biol Cell 89:531-7 (1997)  
Target
Name:
Melatonin receptor type 1A
Synonyms:
MTNR1A MTR1A_HUMAN Mel1a melatonin receptor Melatonin receptor Melatonin receptor type 1 (MT1) | Melatonin receptor type 1A
Type:
Enzyme
Mol. Mass.:
39392.94
Organism:
Homo sapiens (Human)
Description:
P48039
Residue:
350
  
Inhibitor
Name:
BDBM50034110
Synonyms:
CHEMBL15060 N-[2-(5-Methoxy-2-phenyl-1H-indol-3-yl)-ethyl]-acetamide
Type:
Small organic molecule
Emp. Form.:
C19H20N2O2
Mol. Mass.:
308.3743
SMILES:
COc1ccc2[nH]c(c(CCNC(C)=O)c2c1)-c1ccccc1
: