Target
Prostaglandin G/H synthase 2
Ligand
BDBM50056999
Substrate
Ki
180±n/a nM
Comments
PDSP_3990
Citation
 Cryer, BFeldman, M Cyclooxygenase-1 and cyclooxygenase-2 selectivity of widely used nonsteroidal anti-inflammatory drugs. Am J Med 104:413-21 (1998)  
Target
Name:
Prostaglandin G/H synthase 2
Synonyms:
COX2 Cyclooxygenase 2 (COX-2) Cyclooxygenase-2 (COX-2 AA) Cyclooxygenase-2 (COX-2) PGH2_HUMAN PHS II Prostaglandin E synthase/G/H synthase 2 Prostaglandin-endoperoxide synthase 2
Type:
Enzyme
Mol. Mass.:
69003.89
Organism:
Homo sapiens (Human)
Description:
Recombinant Cox-2 provided by Cayman (Cayman Chemical Co.,Ann Arbor, MI).
Residue:
604
  
Inhibitor
Name:
BDBM50056999
Synonyms:
CHEMBL56367 | nimesulide
Type:
Small organic molecule
Emp. Form.:
C13H12N2O5S
Mol. Mass.:
308.31
SMILES:
CS(=O)(=O)Nc1ccc(cc1Oc1ccccc1)[N+]([O-])=O
: