Target
Alpha-1A adrenergic receptor
Ligand
BDBM22869
Substrate
Ki
630.96±n/a nM
Comments
PDSP_552
Citation
 Wikberg-Matsson, AWikberg, JEUhlén, S Characterization of alpha1-adrenoceptor subtypes in the pig. Eur J Pharmacol 347:301-9 (1998)  
Target
Name:
Alpha-1A adrenergic receptor
Synonyms:
ADA1A_CAVPO adrenergic Alpha1A
Type:
Enzyme Catalytic Domain
Mol. Mass.:
51603.72
Organism:
PIG
Description:
adrenergic Alpha1A ADRA1A PIG::Q9WU25
Residue:
466
  
Inhibitor
Name:
BDBM22869
Synonyms:
6-chloro-10-(4-methylpiperazin-1-yl)-2,9-diazatricyclo[9.4.0.0^{3,8}]pentadeca-1,3(8),4,6,10,12,14-heptaene Clozapine US10259786, Clozapine
Type:
Small organic molecule
Emp. Form.:
C18H19ClN4
Mol. Mass.:
326.823
SMILES:
CN1CCN(CC1)C1=c2ccccc2=Nc2ccc(Cl)cc2N1
: