Target
5-hydroxytryptamine receptor 2C
Ligand
BDBM50005246
Substrate
Ki
>10000±n/a nM
Comments
PDSP_296
Citation
 Toll, LBerzetei-Gurske, IPPolgar, WEBrandt, SRAdapa, IDRodriguez, LSchwartz, RWHaggart, DO'Brien, AWhite, AKennedy, JMCraymer, KFarrington, LAuh, JS Standard binding and functional assays related to medications development division testing for potential cocaine and opiate narcotic treatment medications. NIDA Res Monogr 178:440-66 (1998) Target
Name:
5-hydroxytryptamine receptor 2C
Synonyms:
5-HT2C 5-hydroxytryptamine receptor 2C (5HT2c) 5ht1c Htr2c Serotonin receptor 2a and 2c (5HT2A and 5HT2C)
Type:
Enzyme
Mol. Mass.:
51935.10
Organism:
Rattus norvegicus (Rat)
Description:
P08909
Residue:
460
  
Inhibitor
Name:
BDBM50005246
Synonyms:
1-Phenylpropan-2-amin 1-phenylpropan-2-amine AMPHETAMINE Amfetamine DEXTROAMP SACCHARATE alpha-methylphenylethylamine beta-Phenylisopropylamin beta-phenylisopropylamine | desoxynorephedrine
Type:
Small organic molecule
Emp. Form.:
C9H13N
Mol. Mass.:
135.2062
SMILES:
CC(N)Cc1ccccc1
: