Target
Mu-type opioid receptor
Ligand
BDBM50000091
Substrate
Ki
0.3±n/a nM
Comments
PDSP_777
Citation
 Toll, LBerzetei-Gurske, IPPolgar, WEBrandt, SRAdapa, IDRodriguez, LSchwartz, RWHaggart, DO'Brien, AWhite, AKennedy, JMCraymer, KFarrington, LAuh, JS Standard binding and functional assays related to medications development division testing for potential cocaine and opiate narcotic treatment medications. NIDA Res Monogr 178:440-66 (1998) Target
Name:
Mu-type opioid receptor
Synonyms:
M-OR-1 MOR-1 MUOR1 Mu opiate receptor OPRM1 hMOP | mu-type opioid receptor isoform MOR-1
Type:
G Protein-Coupled Receptor (GPCR)
Mol. Mass.:
44789.51
Organism:
Homo sapiens (Human)
Description:
P35372
Residue:
400
  
Inhibitor
Name:
BDBM50000091
Synonyms:
(6S,11R)-3-Cyclopropylmethyl-6-ethyl-8-hydroxy-11-methyl-3,4,5,6-tetrahydro-2H-2,6-methano-benzo[d]azocin-1-one 3-Cyclopropylmethyl-6-ethyl-8-hydroxy-11-methyl-3,4,5,6-tetrahydro-2H-2,6-methano-benzo[d]azocin-1-one 3-Cyclopropylmethyl-6-ethyl-8-hydroxy-11-methyl-3,4,5,6-tetrahydro-2H-2,6-methano-benzo[d]azocin-1-one(Ethylketazocine, EKC) EKC | EKC(-)
Type:
Small organic molecule
Emp. Form.:
C19H25NO2
Mol. Mass.:
299.4073
SMILES:
CC[C@]12CCN(CC3CC3)C([C@@H]1C)C(=O)c1ccc(O)cc21
: