Target
Melatonin receptor type 1A
Ligand
BDBM85362
Substrate
Ki
831.76±n/a nM
Comments
PDSP_168
Citation
 Spadoni, GBalsamini, CBedini, ADiamantini, GDi Giacomo, BTontini, ATarzia, GMor, MPlazzi, PVRivara, SNonno, RPannacci, MLucini, VFraschini, FStankov, BM 2-[N-Acylamino(C1-C3)alkyl]indoles as MT1 melatonin receptor partial agonists, antagonists, and putative inverse agonists. J Med Chem 41:3624-34 (1998)  
Target
Name:
Melatonin receptor type 1A
Synonyms:
MTNR1A MTR1A_HUMAN Mel1a melatonin receptor Melatonin receptor Melatonin receptor type 1 (MT1) | Melatonin receptor type 1A
Type:
Enzyme
Mol. Mass.:
39392.94
Organism:
Homo sapiens (Human)
Description:
P48039
Residue:
350
  
Inhibitor
Name:
BDBM85362
Synonyms:
N-[(1H-Indol-2-yl)alkyl]acylamino Derivatives 5j
Type:
Small organic molecule
Emp. Form.:
C20H22N2O2
Mol. Mass.:
322.4009
SMILES:
CCC(=O)NCCc1cc2c(OC)cccc2n1-c1ccccc1
: