Target
Neuropeptide Y receptor type 4
Ligand
BDBM82282
Substrate
Ki
9±n/a nM
Comments
PDSP_1382
Citation
 Eriksson, HBerglund, MMHolmberg, SKKahl, UGehlert, DRLarhammar, D The cloned guinea pig pancreatic polypeptide receptor Y4 resembles more the human Y4 than does the rat Y4. Regul Pept 0:29-37 (1998)  
Target
Name:
Neuropeptide Y receptor type 4
Synonyms:
NPY-Y4 NPY4R PP1 Pancreatic polypeptide receptor 1
Type:
Enzyme Catalytic Domain
Mol. Mass.:
42207.58
Organism:
Homo sapiens (Human)
Description:
NPY-Y4 PPYR1 HUMAN::P50391
Residue:
375
  
Inhibitor
Name:
BDBM82282
Synonyms:
NPY13-36 | NPY13-36, porcine
Type:
Small organic molecule
Emp. Form.:
C135H209N41O36
Mol. Mass.:
2982.3571
SMILES:
CC[C@H](C)[C@H](NC(=O)[C@H](Cc1ccc(O)cc1)NC(=O)[C@H](Cc1cnc[nH]1)NC(=O)[C@H](CCCN=C(N)N)NC(=O)[C@H](CC(C)C)NC(=O)[C@H](C)NC(=O)[C@H](CO)NC(=O)[C@H](Cc1ccc(O)cc1)NC(=O)[C@H](Cc1ccc(O)cc1)NC(=O)[C@H](CCCN=C(N)N)NC(=O)[C@H](C)NC(=O)[C@H](CC(C)C)NC(=O)[C@H](CC(O)=O)NC(=O)[C@H](CCC(O)=O)NC(=O)[C@H](C)NC(=O)[C@@H]1CCCN1)C(=O)N[C@@H](CC(N)=O)C(=O)N[C@@H](CC(C)C)C(=O)N[C@@H]([C@@H](C)CC)C(=O)N[C@@H]([C@@H](C)O)C(=O)N[C@@H](CCCN=C(N)N)C(=O)N[C@@H](CCC(N)=O)C(=O)N[C@@H](CCCN=C(N)N)C(=O)N[C@@H](Cc1ccc(O)cc1)C(N)=O
: