Target
Galanin receptor type 1
Ligand
BDBM50273367
Substrate
Ki
2.88±n/a nM
Comments
PDSP_3165
Citation
 Borowsky, BWalker, MWHuang, LYJones, KASmith, KEBard, JBranchek, TAGerald, C Cloning and characterization of the human galanin GALR2 receptor. Peptides 19:1771-81 (1998)  
Target
Name:
Galanin receptor type 1
Synonyms:
GAL1-R GALNR1 GALR1_HUMAN Galanin receptor 1 | Galanin receptor type 1
Type:
Enzyme Catalytic Domain
Mol. Mass.:
38976.60
Organism:
Homo sapiens (Human)
Description:
Galanin R1 GALR1 HUMAN::P47211
Residue:
349
  
Inhibitor
Name:
BDBM50273367
Synonyms:
(2S,3S)-2-((S)-2-((S)-2-((S)-1-(2-((S)-2-((S)-2-((S)-2-(2-((S)-2-((S)-2-((S)-4-amino-2-((S)-2-((2S,3R)-2-((S)-2-(2-aminoacetamido)-3-(1H-indol-3-yl)propanamido)-3-hydroxybutanamido)-4-methylpentanamido)-4-oxobutanamido)-3-hydroxypropanamido)propanamido)acetamido)-3-(4-hydroxyphenyl)propanamido)-4-methylpentanamido)-4-methylpentanamido)acetyl)pyrrolidine-2-carboxamido)-3-(1H-imidazol-5-yl)propanamido)propanamido)-3-methylpentanoic acid Galanin (1-16) Galanin (1-16), rat
Type:
Small organic molecule
Emp. Form.:
C78H116N20O21
Mol. Mass.:
1669.877
SMILES:
CC[C@H](C)[C@H](NC(=O)[C@H](C)NC(=O)[C@H](Cc1cnc[nH]1)NC(=O)[C@@H]1CCCN1C(=O)CNC(=O)[C@H](CC(C)C)NC(=O)[C@H](CC(C)C)NC(=O)[C@H](Cc1ccc(O)cc1)NC(=O)CNC(=O)[C@H](C)NC(=O)[C@H](CO)NC(=O)[C@H](CC(N)=O)NC(=O)[C@H](CC(C)C)NC(=O)[C@@H](NC(=O)[C@H](Cc1c[nH]c2ccccc12)NC(=O)CN)[C@@H](C)O)C(O)=O
: