Target
5-hydroxytryptamine receptor 2B
Ligand
BDBM50005251
Substrate
Ki
1039±n/a nM
Comments
PDSP_686
Citation
 Nelson, DLLucaites, VLWainscott, DBGlennon, RA Comparisons of hallucinogenic phenylisopropylamine binding affinities at cloned human 5-HT2A, -HT(2B) and 5-HT2C receptors. Naunyn Schmiedebergs Arch Pharmacol 359:1-6 (1999)  
Target
Name:
5-hydroxytryptamine receptor 2B
Synonyms:
5-HT-2B 5-hydroxytryptamine (serotonin) receptor 2B [Homo sapiens] 5-hydroxytryptamine receptor 2C (5HT2C) HTR2B Serotonin 2b (5-HT2b) receptor | Serotonin Receptor 2B
Type:
G Protein-Coupled Receptor (GPCR)
Mol. Mass.:
54312.47
Organism:
Homo sapiens (Human)
Description:
Receptor binding assays were performed using human clone stably expressed in CHO cells.
Residue:
481
  
Inhibitor
Name:
BDBM50005251
Synonyms:
(+/-)2-(2,5-Dimethoxy-phenyl)-1-methyl-ethylamine 2,5-dimethoxy-4-bromoamphetamine 2-(2,5-Dimethoxy-phenyl)-1-methyl-ethylamine(2,5-DMA) DMA
Type:
Small organic molecule
Emp. Form.:
C11H17NO2
Mol. Mass.:
195.2582
SMILES:
COc1ccc(OC)c(CC(C)N)c1
: