Target
D(2) dopamine receptor
Ligand
BDBM50020222
Substrate
Ki
69.9±n/a nM
Comments
PDSP_194
Citation
 Lawler, CPPrioleau, CLewis, MMMak, CJiang, DSchetz, JAGonzalez, AMSibley, DRMailman, RB Interactions of the novel antipsychotic aripiprazole (OPC-14597) with dopamine and serotonin receptor subtypes. Neuropsychopharmacology 20:612-27 (1999)  
Target
Name:
D(2) dopamine receptor
Synonyms:
DOPAMINE D2 DOPAMINE D2 Short Dopamine D2 receptor Drd2
Type:
G Protein-Coupled Receptor (GPCR)
Mol. Mass.:
50931.60
Organism:
Rattus norvegicus (rat)
Description:
P61169
Residue:
444
  
Inhibitor
Name:
BDBM50020222
Synonyms:
(+/-)-7-(dipropylamino)-5,6,7,8-tetrahydronaphthalen-2-ol (R,S) 7-Dipropylamino-5,6,7,8-tetrahydro-naphthalen-2-ol 7-Dipropylamino-5,6,7,8-tetrahydro-naphthalen-2-ol 7-OH-DPAT 7-OH-DPAT,(-) CHEMBL1255966 | CHEMBL285755
Type:
Small organic molecule
Emp. Form.:
C16H25NO
Mol. Mass.:
247.3758
SMILES:
CCCN(CCC)C1CCc2ccc(O)cc2C1
: