Target
D(3) dopamine receptor
Ligand
BDBM82065
Substrate
Ki
18±n/a nM
Comments
PDSP_1418
Citation
 Lawler, CPPrioleau, CLewis, MMMak, CJiang, DSchetz, JAGonzalez, AMSibley, DRMailman, RB Interactions of the novel antipsychotic aripiprazole (OPC-14597) with dopamine and serotonin receptor subtypes. Neuropsychopharmacology 20:612-27 (1999)  
Target
Name:
D(3) dopamine receptor
Synonyms:
DOPAMINE D3 Dopamine D3 receptor | Drd3
Type:
Protein
Mol. Mass.:
49540.58
Organism:
Rattus norvegicus (Rat)
Description:
P19020
Residue:
446
  
Inhibitor
Name:
BDBM82065
Synonyms:
CAS_163839 OPC-4392
Type:
Small organic molecule
Emp. Form.:
C24H29N3O2
Mol. Mass.:
391.506
SMILES:
Cc1cccc(N2CCN(CCCOc3ccc4ccc(=O)[nH]c4c3)CC2)c1C
: