Target
5-hydroxytryptamine receptor 2A
Ligand
BDBM82548
Substrate
Ki
152±n/a nM
Comments
PDSP_4623
Citation
 Sánchez, CHyttel, J Comparison of the effects of antidepressants and their metabolites on reuptake of biogenic amines and on receptor binding. Cell Mol Neurobiol 19:467-89 (1999)  
Target
Name:
5-hydroxytryptamine receptor 2A
Synonyms:
5-HT-2A 5-HT2A 5-hydroxytryptamine receptor 2A (5HT2A) Htr2 Serotonin Receptor 2A
Type:
G Protein-Coupled Receptor (GPCR)
Mol. Mass.:
52852.05
Organism:
Rattus norvegicus (rat)
Description:
Rat cortex membranes 5-HT2A receptors.
Residue:
471
  
Inhibitor
Name:
BDBM82548
Synonyms:
CAS_897-15-4 NSC_3155
Type:
Small organic molecule
Emp. Form.:
C19H21NS
Mol. Mass.:
295.442
SMILES:
CN(C)CCC=C1c2ccccc2CSc2ccccc12
: