Target
Alpha-1A adrenergic receptor
Ligand
BDBM82548
Substrate
Ki
419±n/a nM
Comments
PDSP_4623
Citation
 Sánchez, CHyttel, J Comparison of the effects of antidepressants and their metabolites on reuptake of biogenic amines and on receptor binding. Cell Mol Neurobiol 19:467-89 (1999)  
Target
Name:
Alpha-1A adrenergic receptor
Synonyms:
ADA1A_RAT Adra1c Alpha-1A adrenoceptor Alpha-1C adrenergic receptor | adrenergic Alpha1A
Type:
Protein
Mol. Mass.:
51620.15
Organism:
Rattus norvegicus (Rat)
Description:
P43140
Residue:
466
  
Inhibitor
Name:
BDBM82548
Synonyms:
CAS_897-15-4 NSC_3155
Type:
Small organic molecule
Emp. Form.:
C19H21NS
Mol. Mass.:
295.442
SMILES:
CN(C)CCC=C1c2ccccc2CSc2ccccc12
: