Target
Adenosine receptor A3
Ligand
BDBM50041906
Substrate
Ki
1.5±n/a nM
Comments
PDSP_123
Citation
 Klotz, KNCamaioni, EVolpini, RKachler, SVittori, SCristalli, G 2-Substituted N-ethylcarboxamidoadenosine derivatives as high-affinity agonists at human A3 adenosine receptors. Naunyn Schmiedebergs Arch Pharmacol 360:103-8 (1999)  
Target
Name:
Adenosine receptor A3
Synonyms:
A3 adenosine receptor (hA3) ADORA3 | Adenosine A3 receptor (A3AR)
Type:
G Protein-Coupled Receptor (GPCR)
Mol. Mass.:
36197.32
Organism:
Homo sapiens (Human)
Description:
P0DMS8
Residue:
318
  
Inhibitor
Name:
BDBM50041906
Synonyms:
2-substituted NECA derivatives, 5 | 5-[6-Amino-2-(3-hydroxy-but-1-ynyl)-purin-9-yl]-3,4-dihydroxy-tetrahydro-furan-2-carboxylic acid ethylamide
Type:
Small organic molecule
Emp. Form.:
C16H20N6O5
Mol. Mass.:
376.3672
SMILES:
CCNC(=O)C1OC(C(O)C1O)n1cnc2c(N)nc(nc12)C#CC(C)O
: