Target
Neuropeptide Y receptor type 1
Ligand
BDBM85535
Substrate
Ki
1.3±n/a nM
Comments
PDSP_6857
Citation
 Berglund, MMHolmberg, SKEriksson, HGedda, KMaffrand, JPSerradeil-Le Gal, CChhajlani, VGrundemar, LLarhammar, D The cloned guinea pig neuropeptide Y receptor Y1 conforms to other mammalian Y1 receptors. Peptides 20:1043-53 (1999)  
Target
Name:
Neuropeptide Y receptor type 1
Synonyms:
FC5 NPY1-R Neuropeptide Y receptor type 1 | Npy1r
Type:
Enzyme Catalytic Domain
Mol. Mass.:
44126.41
Organism:
RAT
Description:
NPY-Y1 NPY1R RAT::P21555
Residue:
382
  
Inhibitor
Name:
BDBM85535
Synonyms:
CAS_5312150 | SR 120819A
Type:
Small organic molecule
Emp. Form.:
C43H54N6O4S
Mol. Mass.:
750.992
SMILES:
CN(C)CC1CCC(CN=C(N)c2ccc(CC(NC(=O)C(Cc3ccccc3)NS(=O)(=O)c3ccc4ccccc4c3)C(=O)N3CCCC3)cc2)CC1
: