Target
Somatostatin receptor type 1
Ligand
BDBM82464
Substrate
Ki
83.17±n/a nM
Comments
PDSP_1591
Citation
 Siehler, SSeuwen, KHoyer, D Characterisation of human recombinant somatostatin receptors. 1. Radioligand binding studies. Naunyn Schmiedebergs Arch Pharmacol 360:488-99 (1999)  
Target
Name:
Somatostatin receptor type 1
Synonyms:
SOMATOSTATIN SST1 SS-1-R SS1R SSTR1 | Somatostatin receptor type 1 (SSTR1)
Type:
Enzyme
Mol. Mass.:
42692.81
Organism:
Homo sapiens (Human)
Description:
P30872
Residue:
391
  
Inhibitor
Name:
BDBM82464
Synonyms:
CAS_71306 RC 160 | Vapreotide
Type:
Small organic molecule
Emp. Form.:
C57H70N12O9S2
Mol. Mass.:
1131.371
SMILES:
CC(C)C1NC(=O)C(CCCCN)NC(=O)C(Cc2c[nH]c3ccccc23)NC(=O)C(Cc2ccc(O)cc2)NC(=O)C(CSSCC(NC1=O)C(=O)NC(Cc1c[nH]c2ccccc12)C(N)=O)NC(=O)C(N)Cc1ccccc1
: