Target
5-hydroxytryptamine receptor 2C
Ligand
BDBM50017452
Substrate
Ki
150±n/a nM
Comments
PDSP_1240
Citation
 Egan, CGrinde, EDupre, ARoth, BLHake, MTeitler, MHerrick-Davis, K Agonist high and low affinity state ratios predict drug intrinsic activity and a revised ternary complex mechanism at serotonin 5-HT(2A) and 5-HT(2C) receptors. Synapse 35:144-50 (2000)  
Target
Name:
5-hydroxytryptamine receptor 2C
Synonyms:
5-HT2C 5-hydroxytryptamine receptor 2C (5HT2c) 5ht1c Htr2c Serotonin receptor 2a and 2c (5HT2A and 5HT2C)
Type:
Enzyme
Mol. Mass.:
51935.10
Organism:
Rattus norvegicus (Rat)
Description:
P08909
Residue:
460
  
Inhibitor
Name:
BDBM50017452
Synonyms:
2-chloro-6-piperazin-1-ylpyrazine 6'-Chloro-3,4,5,6-tetrahydro-2H-[1,2']bipyrazinyl(MK-212) L-630,571 MK-212
Type:
Small organic molecule
Emp. Form.:
C8H11ClN4
Mol. Mass.:
198.653
SMILES:
Clc1cncc(n1)N1CCNCC1
: