Target
5-hydroxytryptamine receptor 2C
Ligand
BDBM85530
Substrate
Ki
56±n/a nM
Comments
PDSP_1353
Citation
 Fitzgerald, LWBurn, TCBrown, BSPatterson, JPCorjay, MHValentine, PASun, JHLink, JRAbbaszade, IHollis, JMLargent, BLHartig, PRHollis, GFMeunier, PCRobichaud, AJRobertson, DW Possible role of valvular serotonin 5-HT(2B) receptors in the cardiopathy associated with fenfluramine. Mol Pharmacol 57:75-81 (2000) Target
Name:
5-hydroxytryptamine receptor 2C
Synonyms:
5-HT-1C 5-HT1C 5-HT2C-INI 5-HTR2C 5-hydroxytryptamine receptor 2C (5-HT-2C) 5HT-1C HTR1C Serotonin (5-HT3) receptor Serotonin Receptor 2C
Type:
G Protein-Coupled Receptor (GPCR)
Mol. Mass.:
51836.79
Organism:
Homo sapiens (Human)
Description:
P28335
Residue:
458
  
Inhibitor
Name:
BDBM85530
Synonyms:
Nor-d-fenfluramine Norfenfluramine Norfenfluramine (-) | d-Norfenfluramine
Type:
Small organic molecule
Emp. Form.:
C10H12F3N
Mol. Mass.:
203.2042
SMILES:
C[C@H](N)Cc1cccc(c1)C(F)(F)F
: