Target
Prostaglandin E2 receptor EP2 subtype
Ligand
BDBM85603
Substrate
Ki
6±n/a nM
Comments
PDSP_4312
Citation
 Abramovitz, MAdam, MBoie, YCarrière, MDenis, DGodbout, CLamontagne, SRochette, CSawyer, NTremblay, NMBelley, MGallant, MDufresne, CGareau, YRuel, RJuteau, HLabelle, MOuimet, NMetters, KM The utilization of recombinant prostanoid receptors to determine the affinities and selectivities of prostaglandins and related analogs. Biochim Biophys Acta 1483:285-93 (2000)  
Target
Name:
Prostaglandin E2 receptor EP2 subtype
Synonyms:
PE2R2_HUMAN PTGER2 Prostaglandin E2 receptor Prostanoid EP2 Receptor
Type:
Enzyme
Mol. Mass.:
39775.71
Organism:
Homo sapiens (Human)
Description:
P43116
Residue:
358
  
Inhibitor
Name:
BDBM85603
Synonyms:
CAS_5311503 ZK110841
Type:
Small organic molecule
Emp. Form.:
C21H33ClO4
Mol. Mass.:
384.937
SMILES:
OC(C=CC1C(O)CC(Cl)C1CC=CCCCC(O)=O)C1CCCCC1
: