Target
5-hydroxytryptamine receptor 6
Ligand
BDBM50098551
Substrate
Ki
6309.57±n/a nM
Comments
PDSP_3688
Citation
 Lovell, PJBromidge, SMDabbs, SDuckworth, DMForbes, ITJennings, AJKing, FDMiddlemiss, DNRahman, SKSaunders, DVCollin, LLHagan, JJRiley, GJThomas, DR A novel, potent, and selective 5-HT(7) antagonist: (R)-3-(2-(2-(4-methylpiperidin-1-yl)ethyl)pyrrolidine-1-sulfonyl) phen ol (SB-269970). J Med Chem 43:342-5 (2000)  
Target
Name:
5-hydroxytryptamine receptor 6
Synonyms:
5-HT-6 5-hydroxytryptamine receptor 6 (5-HT-6) 5-hydroxytryptamine receptor 6 (5HT6) HTR6 Serotonin 6 (5-HT6) receptor | Serotonin Receptor 6
Type:
G Protein-Coupled Receptor (GPCR)
Mol. Mass.:
46968.43
Organism:
Homo sapiens (Human)
Description:
P50406
Residue:
440
  
Inhibitor
Name:
BDBM50098551
Synonyms:
(R)-3-(2-(2-(4-methylpiperidin-1-yl)ethyl)pyrrolidin-1-ylsulfonyl)phenol 3-{(R)-2-[2-(4-Methyl-piperidin-1-yl)-ethyl]-pyrrolidine-1-sulfonyl}-phenol 3-{2-[2-(4-Methyl-piperidin-1-yl)-ethyl]-pyrrolidine-1-sulfonyl}-phenol CHEMBL282199 | SB-269970
Type:
Small organic molecule
Emp. Form.:
C18H28N2O3S
Mol. Mass.:
352.492
SMILES:
CC1CCN(CC[C@H]2CCCN2S(=O)(=O)c2cccc(O)c2)CC1
: