Target
5-hydroxytryptamine receptor 1A
Ligand
BDBM50050467
Substrate
Ki
1000±n/a nM
Comments
PDSP_3305
Citation
 Millan, MJGobert, ANewman-Tancredi, ALejeune, FCussac, DRivet, JMAudinot, VDubuffet, TLavielle, G S33084, a novel, potent, selective, and competitive antagonist at dopamine D(3)-receptors: I. Receptorial, electrophysiological and neurochemical profile compared with GR218,231 and L741,626. J Pharmacol Exp Ther 293:1048-62 (2000) Target
Name:
5-hydroxytryptamine receptor 1A
Synonyms:
5-HT-1A 5-hydroxytryptamine receptor 1A (5-HT-1A) ADRB2RL1 Dopamine D2 receptor and serotonin 1a receptor HTR1A | Serotonin receptor 1A
Type:
Mol. Mass.:
46122.49
Organism:
Homo sapiens (Human)
Description:
Residue:
422
  
Inhibitor
Name:
BDBM50050467
Synonyms:
1-((1H-indol-3-yl)methyl)-4-(4-chlorophenyl)piperidin-4-ol 4-(4-Chloro-phenyl)-1-(1H-indol-3-ylmethyl)-piperidin-4-ol L-741626 | L741,626
Type:
Small organic molecule
Emp. Form.:
C20H21ClN2O
Mol. Mass.:
340.847
SMILES:
OC1(CCN(Cc2c[nH]c3ccccc23)CC1)c1ccc(Cl)cc1
: